HUMANITIES-THESAURUS
type: ConceptScheme

Ιστορικές επαγγελματικές ομάδες
type: Concept
notation: 2636
preferred label: Historical occupational groups @en
narrower: Χανιτζήδες

Χανιτζήδες
type: Concept
modified: 2020-10-20
notation: 1038
scope note: Οι ιδιοκτήτες ενός χανιού. Στα χάνια ξεκουράζονταν και διανυκτέρευαν οι οδοιπόροι. Η αμοιβή των χανιτζήδων περιελάμβανε το φαγητό, τον ύπνο, το τάισμα των ζώων και οτιδήποτε άλλο χρεωνόταν ο περαστικός. Επίσης, οι χανιτζήδες προσέφεραν στους ταξιδιώτες πληροφορίες για τη συνέχεια του ταξιδιού τους.
scope note: The owners of an inn called hani, in which travellers could rest overnight. The innkeepers charged travellers for food, accommodation, feeding their animals, and any other needs. Innkeepers also provided travellers with information on their journey’s route. @en
creator: Φαλιέρου Αναστασία (ΑΑ)
creator: Falierou Anastasia (AA) @la
created: 2015-10-25
broader: Ιστορικές επαγγελματικές ομάδες
in scheme: HUMANITIES-THESAURUS
status: Εκδοθείς
contributor: Φαλιέρου Αναστασία (ΑΑ)
contributor: Falierou Anastasia (AA) @fr
preferred label: Innkeepers @en
alternative label: Πανδοχείς
source: Δαφέρμος 2007