HUMANITIES-THESAURUS
type: ConceptScheme

Επιγραφική
type: Concept
notation: 573
preferred label: Epigraphy @en
related: Γαλάζια αλφάβητα

Επιχώρια αλφάβητα
type: Concept
narrower: Γαλάζια αλφάβητα
notation: 662
preferred label: Local alphabets @en

Επιγραφές (Επιγραφική)
type: Concept
notation: 69
preferred label: Inscriptions (Epigraphy) @en
related: Γαλάζια αλφάβητα

Γαλάζια αλφάβητα
type: Concept
contributor: Katsiadakis Helen (AA) @en
contributor: Κατσιαδάκη Ελένη (ΑΑ)
created: 2015-07-13
creator: Χρυσοβιτσάνος Γεράσιμος (ΑΑ)
creator: Chrysovitsanos Gerasimos (AA) @fr
modified: 2018-12-03
source: Τουράτσογλου (et al.) 2002
status: Εκδοθείς
broader: Επιχώρια αλφάβητα
in scheme: HUMANITIES-THESAURUS
notation: 995
preferred label: Light blue alphabets @en
related: Επιγραφική
related: Επιγραφές (Επιγραφική)
scope note: A type of archaic alphabet that gathers common features of the alphabets of Attica, Aegina, the Ionian islands of the Cyclades (Sifnos, Paros, Naxos, Delos and Paros Thassos). The name of the alphabet was established in 1887 by Adolf Kirchhoff. @en
scope note: Τύπος αρχαϊκού αλφαβήτου ο οποίος συγκεντρώνει κοινά χαρακτηριστικά των αλφαβήτων της Αττικής, της Αίγινας, των ιωνικών νησιών των Κυκλάδων (Σίφνος, Πάρος, Νάξος, Δήλος και η αποκία της Πάρου Θάσος). Η ονομασία αυτή καθιερώθηκε το 1887 από τον Adolf Kirchhoff.