HUMANITIES-THESAURUS
type: ConceptScheme

Κατάλογοι νικητών αθλητικών αγώνων
type: Concept
broader: Επιγραφές αθλητικών αγώνων
notation: 2193
preferred label: Catalogues of victors in athletic games @en

Ψηφίσματα αναγνώρισης αθλητικών αγώνων
type: Concept
broader: Επιγραφές αθλητικών αγώνων
notation: 2194
preferred label: Αthletic games recognition decrees @en

Επιγραφική
type: Concept
notation: 573
preferred label: Epigraphy @en
related: Επιγραφές αθλητικών αγώνων

Επιγραφές δημοσίου χαρακτήρα
type: Concept
narrower: Επιγραφές αθλητικών αγώνων
notation: 584
preferred label: Public inscriptions @en

Επιγραφές αθλητικών αγώνων
type: Concept
contributor: Κατσιαδάκη Ελένη (ΑΑ)
contributor: Katsiadakis Helen (AA) @en
created: 2015-08-05
creator: Chrysovitsanos Gerasimos (AA) @la
creator: Χρυσοβιτσάνος Γεράσιμος (ΑΑ)
modified: 2018-12-03
source: Κουμανούδης & Ματθαίου 1986
status: Εκδοθείς
broader: Επιγραφές δημοσίου χαρακτήρα
in scheme: HUMANITIES-THESAURUS
narrower: Ψηφίσματα αναγνώρισης αθλητικών αγώνων
narrower: Κατάλογοι νικητών αθλητικών αγώνων
notation: 978
preferred label: Athletic games inscriptions @en
related: Επιγραφική
scope note: Επιγραφές που σχετίζονται με αθλητικούς αγώνες. Το περιεχόμενο τους μπορούσε να ποικίλει, από την καθιέρωση αγώνων και την ανάδειξη τοπικών αγώνων σε ισάξιους με τους τέσσερις μεγαλύτερους εκείνων των χρόνων (Ολύμπια, Πύθια, Νέμεα, Ίσθμια), μέχρι την αναγραφή των νικητών στα αθλήματα.
scope note: Inscriptions related to athletic games. Their content could range from the introduction of athletic games and the elevation of local games to a rank equaling that of the four major games (Olympia, Pythia, Nemea, Isthmia) to the recording of the names of the winners in the contests. @en