HUMANITIES-THESAURUS
type: ConceptScheme

Έργα τέχνης
type: Concept
narrower: Ελαιογραφίες
notation: 618
preferred label: Artworks @en

Ελαιογραφίες
type: Concept
contributor: Ξηροπαϊδης Γιώργος (ΑΣΚΤ)
contributor: Xiropaidis Georgios (ASFA) @la
created: 2015-10-05
creator: Xiropaidis Georgios (ASFA) @de
creator: Ξηροπαϊδης Γιώργος (ΑΣΚΤ)
modified: 2015-10-30
source: The J. Paul Getty Trust 2015
status: Εκδοθείς
broader: Έργα τέχνης
in scheme: HUMANITIES-THESAURUS
notation: 973
preferred label: Oil paintings @en
scope note: Creative works produced in oil paint, which is pigment suspended in vegetal drying oils. @en
scope note: Έργα τέχνης φιλοτεχνημένα μέσω της χρήσης χρώματος αναμεμιγμένου με έλαια.