HUMANITIES-THESAURUS
type: ConceptScheme

Έργα τέχνης
type: Concept
narrower: Κρητιδογραφίες
notation: 618
preferred label: Artworks @en

Κρητιδογραφίες
type: Concept
contributor: Xiropaidis Georgios (ASFA) @en
contributor: Ξηροπαϊδης Γιώργος (ΑΣΚΤ)
created: 2015-10-05
creator: Xiropaidis Georgios (ASFA) @de
creator: Ξηροπαϊδης Γιώργος (ΑΣΚΤ)
modified: 2015-10-30
source: The J. Paul Getty Trust 2015
status: Εκδοθείς
alternative label: Παστέλ
broader: Έργα τέχνης
in scheme: HUMANITIES-THESAURUS
notation: 959
preferred label: Pastels @en
scope note: Artworks, typically on a paper or vellum support, to which designs are applied using crayons made of ground pigment held together with a binder, typically oil or water and gum. Works in this medium are sometimes classified as drawings, and sometimes as paintings, typically based on the local curatorial department responsible for the work or on the material of the support (pastels on paper may be classified as drawings, while pastels on vellum may be classified as paintings). @en
scope note: Έργα τέχνης, συνήθως σε χαρτί, φιλοτεχνημένα μέσω ενός τύπου χρωματιστής κιμωλίας (παστέλ) και συνδετικού υλικού.