HUMANITIES-THESAURUS
type: ConceptScheme

Ομοιόπτωτος προσδιορισμός
type: Concept
narrower: Επιθετικός προσδιορισμός
notation: 374
preferred label: Agreeing modifier @en

Επιθετικός προσδιορισμός
type: Concept
contributor: Katsiadakis Helen (AA) @en
contributor: Κατσιαδάκη Ελένη (ΑΑ)
created: 2015-07-02
creator: Χατζημιχαήλ Χρήστος (ΑΑ)
creator: Chatzimichail Christos (AA) @fr
modified: 2015-10-04
source: Μπαχαράκης 2010
status: Εκδοθείς
alternative label: Attributive position @en
broader: Ομοιόπτωτος προσδιορισμός
in scheme: HUMANITIES-THESAURUS
notation: 919
preferred label: Attributive adjective @en
scope note: Επιθετικός προσδιορισμός λέγεται το επίθετο που προσδιορίζει ένα ουσιαστικό, αποδίδοντας σε αυτό μια ιδιότητα προϋπάρχουσα, γνωστή και σταθερή με τέτοιο τρόπο ώστε να αποτελεί μαζί του μία έννοια, δηλαδή μία σημασιολογική και συντακτική μονάδα με εξειδικευμένο νόημα. Ο επιθετικός προσδιορισμός, χαρακτηρίζοντας ποιοτικά το προσδιοριζόμενο, περιορίζει το πλάτος του και το ξεχωρίζει από τα άλλα όμοιά του που δεν έχουν αυτήν την ιδιότητα. Μπορεί να συνοδεύεται ή μπορεί να μην συνοδεύεται από άρθρο. Ως επιθετικός προσδιορισμός τίθεται επίθετο ή ό,τι άλλο ισοδύναμο.