HUMANITIES-THESAURUS
type: ConceptScheme

Ιστορικές επαγγελματικές ομάδες
type: Concept
narrower: Ντελάληδες
notation: 2636
preferred label: Historical occupational groups @en

Ντελάληδες
type: Concept
contributor: Φαλιέρου Αναστασία (ΑΑ)
contributor: Falierou Anastasia (AA) @fr
created: 2015-10-19
creator: Φαλιέρου Αναστασία (ΑΑ)
creator: Falierou Anastasia (AA) @la
modified: 2020-10-20
source: Χαραλαμπάκης 2014
status: Εκδοθείς
broader: Ιστορικές επαγγελματικές ομάδες
in scheme: HUMANITIES-THESAURUS
notation: 889
preferred label: Town criers @en
scope note: Δημόσιοι κήρυκες που ανάγγελλαν μεγαλόφωνα ειδήσεις ή γεγονότα στις γειτονιές των πόλεων ή των χωριών.
scope note: Public preachers, who announced news or events in the neighborhoods of cities or villages in a loud voice. @en