HUMANITIES-THESAURUS
type: ConceptScheme

Έργα τέχνης
type: Concept
narrower: Κολάζ
notation: 618
preferred label: Artworks @en

Κολάζ
type: Concept
contributor: Xiropaidis Georgios (ASFA) @la
contributor: Ξηροπαϊδης Γιώργος (ΑΣΚΤ)
created: 2015-10-05
creator: Xiropaidis Georgios (ASFA) @en
creator: Ξηροπαϊδης Γιώργος (ΑΣΚΤ)
modified: 2015-10-30
source: The J. Paul Getty Trust 2015
status: Εκδοθείς
broader: Έργα τέχνης
in scheme: HUMANITIES-THESAURUS
notation: 839
preferred label: Collages @en
scope note: Δισδιάστατα έργα τέχνης που φιλοτεχνούνται μέσω κoλλημένου χαρτιού, υφάσματος, φωτογραφίας ή άλλων, συνήθως επίπεδων, υλικών.
scope note: Artworks in two dimensions or very low relief that were made by gluing paper, fabrics, photographs, or other materials onto a flat surface. @en