HUMANITIES-THESAURUS
type: ConceptScheme

Αποδέκτης της αφήγησης
type: Concept
narrower: Εξωδιηγητικός αποδέκτης της αφήγησης
notation: 589
preferred label: Narratee @en
preferred label: Narrataire @fr

Εξωδιηγητικός αποδέκτης της αφήγησης
type: Concept
contributor: Κατσιαδάκη Ελένη (ΑΑ)
contributor: Katsiadakis Helen (AA) @en
created: 2015-10-14
creator: Kalafata Patritsia (AA) @la
creator: Καλαφατά Πατρίτσια (ΑΑ)
modified: 2018-11-09
source: Genette 1983
source: Τζούμα 1997
status: Εκδοθείς
broader: Αποδέκτης της αφήγησης
in scheme: HUMANITIES-THESAURUS
notation: 739
preferred label: Narrataire extradiégétique @fr
preferred label: Extradiegetic narratee @en
scope note: Narrative technique in which the narratee is a person not involved in the story. On rare occasions this person can be identified with the reader. @en
scope note: Αφηγηματικός τρόπος κατά τον οποίο ο αποδέκτης ταυτίζεται με κάποιο πρόσωπο έξω από την ιστορία, και σπάνια με τον αναγνώστη.