HUMANITIES-THESAURUS
type: ConceptScheme

Πληροφοριακά αντικείμενα
type: Concept
narrower: Παραστασιακά κείμενα
notation: 240
preferred label: Information objects @en

Παραστασιακά κείμενα
type: Concept
contributor: Katsiadakis Helen (AA) @en
contributor: Κατσιαδάκη Ελένη (ΑΑ)
created: 2015-10-27
creator: Goulis Helen (AA) @la
creator: Γουλή Ελένη (ΑΑ)
modified: 2019-02-12
source: De Marinis 1993
source: Elam 2001
status: Εκδοθείς
broader: Πληροφοριακά αντικείμενα
in scheme: HUMANITIES-THESAURUS
notation: 698
preferred label: Performance texts @en
preferred label: Textes spectaculaires @fr
preferred label: Aufführungstexte @de
scope note: Σύμφωνα με τη σύγχρονη παραστασιο-κεντρική θεώρηση του θεάτρου, που αντιλαμβάνεται το κείμενο ως ένα από τα συστατικά στοιχεία της παράστασης και όχι απαραίτητα ως το προεξάρχον, το παραστασιακό κείμενο δηλώνει οποιοδήποτε κείμενο μπορεί να χρησιμοποιηθεί σε μία παράσταση. Πρόκειται για ένα νέο έργο, με νέα δομή, που μπορεί να περιλαμβάνει το δραματικό κείμενο αλλά δεν ταυτίζεται μαζί του.
scope note: According to the contemporary performance-centered approach of theatre that conceives the dramatic text as one of the performance elements, not necessarily the predominant one, performance text denotes any text that can be used in a performance. It is a new play with a new structure that can comprise the dramatic text but is not identical to it. @en