HUMANITIES-THESAURUS
type: ConceptScheme

Παρασημαντική
type: Concept
narrower: Σημεία κρούσεως
notation: 119
preferred label: Parasemantics @en

Σημεία κρούσεως
type: Concept
contributor: Katsiadakis Helen (AA) @en
contributor: Κατσιαδάκη Ελένη (ΑΑ)
created: 2015-04-17
creator: Τερζής Χρήστος (ΑΑ)
creator: Terzis Christos (AA) @fr
modified: 2015-10-19
source: Μιχαηλίδης 1982
status: Εκδοθείς
alternative label: Κρουματογραφία
broader: Παρασημαντική
in scheme: HUMANITIES-THESAURUS
notation: 688
preferred label: Instrumental notation @en
scope note: Το σύνολο των σημείων που συγκροτεί το σύστημα οργανικής σημειογραφίας του αρχαιοελληνικού μέλους.