HUMANITIES-THESAURUS
type: ConceptScheme

Αφηγηματολογία (Μέθοδοι)
type: Concept
narrower: Αναφερόμενος λόγος
notation: 215
preferred label: Narratology (Methods) @en

Αναφερόμενος λόγος
type: Concept
contributor: Katsiadakis Helen (AA) @en
contributor: Κατσιαδάκη Ελένη (ΑΑ)
created: 2015-10-21
creator: Καλαφατά Πατρίτσια (ΑΑ)
creator: Kalafata Patritsia (AA) @la
modified: 2018-11-09
source: Καψωμένος 2003
status: Εκδοθείς
alternative label: Ευθύς λόγος
broader: Αφηγηματολογία (Μέθοδοι)
in scheme: HUMANITIES-THESAURUS
notation: 624
preferred label: Reported speech @en
preferred label: Discours rapporté @fr
scope note: Αφηγηματικός τρόπος κατά τον οποίο ο αφηγητής παραχωρεί τον λόγο στους χαρακτήρες του αφηγήματος. Τα λόγια του χαρακτήρα παρατίθενται από τον αφηγητή αυτούσια χωρίς την παρέμβασή του. Συνήθως σε ένα αφηγηματικό κείμενο έχουμε τη διάκριση ανάμεσα στον λόγο των ηρώων (ευθύς λόγος/διαλογικά μέρη) και σε εκείνον του αφηγητή (αφηγηματικά μέρη).
scope note: A narrative technique in which the character’s words are cited verbatim by the narrator. @en