HUMANITIES-THESAURUS
type: ConceptScheme

Propositional objects
type: Concept
narrower: Anthropological theories of kinship
notation: 25
preferred label: Προτασιακά αντικείμενα @el

Anthropological theories of kinship
type: Concept
contributor: Κατσιαδάκη Ελένη (ΑΑ) @el
contributor: Katsiadakis Helen (AA)
created: 2015-05-04
creator: Souyioultzoglou Iraklitos (AA)
creator: Σουγιουλτζόγλου Ηράκλειτος (ΑΑ) @el
modified: 2020-05-06
source: Τουντασάκη 2013
status: Εκδοθείς
broader: Propositional objects
in scheme: HUMANITIES-THESAURUS
notation: 55
preferred label: Ανθρωπολογικές θεωρίες της συγγένειας @el
scope note: Θεωρητικά ερμηνευτικά συστήματα της Ανθρωπολογίας, που αναφέρονται στις δομές συγγένειας και στις κοινωνικές σχέσεις που τις διέπουν. @el
scope note: Theoretical models used in Anthropology in order to describe and interpret structures of kinship and the corresponding social relationships.