HUMANITIES-THESAURUS
type: ConceptScheme

Κράτη
type: Concept
narrower: Εθνικά κράτη
notation: 133
preferred label: States @en

Εθνικά κράτη
type: Concept
contributor: Κατσιαδάκη Ελένη (ΑΑ)
contributor: Katsiadakis Helen (AA) @en
created: 2015-08-05
creator: Tzedopoulos Giorgos (AA) @de
creator: Τζεδόπουλος Γιώργος (ΑΑ)
modified: 2018-11-06
source: Roeder 2007
status: Εκδοθείς
broader: Κράτη
in scheme: HUMANITIES-THESAURUS
notation: 537
preferred label: Nation-states @en
scope note: State organizations that rule over a territory in the name of the political community of the nation. Nation-states emerged in the modern period through economic, social and ideological processes. @en
scope note: Κρατικές οργανώσεις που ασκούν εξουσία επί μιας επικράτειας στο όνομα της πολιτικής κοινότητας του έθνους. Τα εθνικά κράτη αναδύονται ως παράγωγα οικονομικών, κοινωνικών και ιδεολογικών εξελίξεων κατά την εποχή της νεωτερικότητας.