HUMANITIES-THESAURUS
type: ConceptScheme

Κοινωνικές ομάδες
type: Concept
narrower: Κοινωνικές ελίτ
notation: 127
preferred label: Social groups @en

Κοινωνικές ελίτ
type: Concept
contributor: Κατσιαδάκη Ελένη (ΑΑ)
contributor: Katsiadakis Helen (AA) @en
created: 2015-06-11
creator: Tzedopoulos Giorgos (AA) @fr
creator: Τζεδόπουλος Γιώργος (ΑΑ)
modified: 2018-11-06
source: Giddens 1974
status: Εκδοθείς
broader: Κοινωνικές ομάδες
in scheme: HUMANITIES-THESAURUS
notation: 534
preferred label: Social elites @en
scope note: Groups of individuals who hold leading positions at the top of social organizations and institutions. The members of the elites have dense interaction with each other and develop a sense of common ethics and interests. @en
scope note: Ομάδες προσώπων που κατέχουν ηγετικές θέσεις στην κορυφή κοινωνικών οργανισμών και θεσμών. Τα μέλη των ελίτ αναπτύσσουν μεταξύ τους έντονη διάδραση και διακρίνονται από κοινό ήθος και αντίληψη κοινών συμφερόντων.