HUMANITIES-THESAURUS
type: ConceptScheme

Ονομαστική
type: Concept
contributor: Katsiadakis Helen (AA) @en
contributor: Κατσιαδάκη Ελένη (ΑΑ)
created: 2015-07-02
creator: Chatzimichail Christos (AA) @fr
creator: Χατζημιχαήλ Χρήστος (ΑΑ)
modified: 2015-10-04
source: Μπαμπινιώτης 2005
source: Χαραλαμπάκης 2014
status: Εκδοθείς
broader: Πτώσεις (γραμματική)
in scheme: HUMANITIES-THESAURUS
notation: 465
preferred label: Nominative @en
scope note: Η πτώση που χρησιμοποιείται βασικά για να δηλώσει σε μια πρόταση το γραμματικό υποκείμενο του ρήματος και το κατηγορούμενό του.

Πτώσεις (γραμματική)
type: Concept
narrower: Ονομαστική
notation: 48
preferred label: Cases (grammar) @en