HUMANITIES-THESAURUS
type: ConceptScheme

Κοινότητες (συλλογικότητες)
type: Concept
notation: 208
preferred label: Communities (collectivities) @en
related: Κοινότητα (προτασιακό αντικείμενο)

Προτασιακά αντικείμενα
type: Concept
narrower: Κοινότητα (προτασιακό αντικείμενο)
notation: 25
preferred label: Propositional objects @en

Κοινότητα (προτασιακό αντικείμενο)
type: Concept
contributor: Κατσιαδάκη Ελένη (ΑΑ)
contributor: Katsiadakis Helen (AA) @en
created: 2015-06-25
creator: Σουγιουλτζόγλου Ηράκλειτος (ΑΑ)
creator: Souyioultzoglou Iraklitos (AA) @de
modified: 2020-08-26
source: Ritzer & Ryan 2011
source: Cohen 1985
status: Εκδοθείς
broader: Προτασιακά αντικείμενα
in scheme: HUMANITIES-THESAURUS
notation: 348
preferred label: Community (propositional object) @en
related: Κοινότητες (συλλογικότητες)
related: Συλλογική ταυτότητα
related: Κοινότητες (κοινωνικές ομάδες)
scope note: The conceptual scheme that refers to the nexus of common values, perceptions and actions that characteriσe collectivities and groups. The conceptual features of the community involve the composition of collective identities and the emergence of symbolic boundaries, which shape the consciousness of common belonging into a distinct and coherent whole. @en
scope note: Το νοητικό σχήμα που παραπέμπει στο πλέγμα κοινών αξιών, αντιλήψεων, σκοπών και ενεργειών που χαρακτηρίζουν συλλογικότητες και ομάδες. Η εννοιολογική προσέγγιση της κοινότητας αφορά στη σύνθεση συλλογικών ταυτοτήτων και στην ανάδειξη συμβολικών ορίων, που διαμορφώνουν τη συνείδηση του ανήκειν σε ένα διακριτό και συνεκτικό σύνολο.

Συλλογική ταυτότητα
type: Concept
notation: 600
preferred label: Collective identity @en
related: Κοινότητα (προτασιακό αντικείμενο)

Κοινότητες (κοινωνικές ομάδες)
type: Concept
notation: 724
preferred label: Communities (social groups) @en
related: Κοινότητα (προτασιακό αντικείμενο)