HUMANITIES-THESAURUS
type: ConceptScheme

Καλλιτεχνικά ρεύματα
type: Concept
narrower: Κονστρουκτιβισμός
notation: 27

Κονστρουκτιβισμός
type: Concept
contributor: Βερναρδάκη Ελένη (ΑΑ)
contributor: Vernardaki Eleni (AA) @fr
created: 2015-10-15
creator: Xiropaidis Georgios (ASFA) @de
creator: Ξηροπαϊδης Γιώργος (ΑΣΚΤ)
modified: 2019-11-20
source: Delahunt 1996-2010
status: Εκδοθείς
broader: Καλλιτεχνικά ρεύματα
in scheme: HUMANITIES-THESAURUS
notation: 343
preferred label: Constructivism @en
scope note: Καλλιτεχνικό κίνημα που εμφανίσθηκε στην προεπαναστατική Ρωσία. Στόχευε στην κατασκευή έργων που θα είχαν χρηστική λειτουργία και θα λάμβαναν υπόψη τόσο τη νέα τεχνολογία όσο και το υλικό κατασκευής (γυαλί, πλαστικό, σίδερο κλπ.).
scope note: A modern art movemet developed in Russia The aim was to construct abstract sculpture suitable for an industrialized society, and the work pioneered the use of modern technology and materials such as wood, glass, plastics, and steel. @en