HUMANITIES-THESAURUS
type: ConceptScheme

Κατασκευή υλικών αντικειμένων & εγκαταστάσεων
type: Concept
narrower: Δευτερογενής παραγωγή
notation: 205

Δευτερογενής παραγωγή
type: Concept
contributor: Katsiadakis Helen (AA) @en
contributor: Κατσιαδάκη Ελένη (ΑΑ)
created: 2020-09-21
creator: Κατσιαδάκη Ελένη (ΑΑ)
creator: Katsiadakis Helen (AA) @en
modified: 2020-09-21
status: Εκδοθείς
broader: Κατασκευή υλικών αντικειμένων & εγκαταστάσεων
in scheme: HUMANITIES-THESAURUS
notation: 2621
preferred label: Secondary production @en
scope note: Secondary production is a production sector that makes use of primary production, with the processing of raw materials. Its individual branches are handicrafts, artisanship and industry. The secondary sector includes the processing of products, such as the production units of pasteurized milk, tomato paste, plastics, furniture, clothing, paper, etc. @en
scope note: Τομέας απασχόλησης που αξιοποιεί την πρωτογενή παραγωγή, με την μεταποίηση πρώτων υλών. Επί μέρους κλάδοι της είναι η χειροτεχνία, η βιοτεχνία και η βιομηχανία. Ο δευτερογενής τομέας περιλαμβάνει τις δραστηριότητες επεξεργασίας και μεταποίησης προϊόντων, όπως οι παραγωγικές μονάδες παστεριωμένου γάλακτος, τοματοπολτού, πλαστικών, επίπλων, ενδυμάτων, χαρτιού κλπ.