HUMANITIES-THESAURUS
type: ConceptScheme

Επιστημονικά όργανα
type: Concept
narrower: Ηλιακά ρολόγια
notation: 1888
preferred label: Scientific instruments @en

Αστρονομία
type: Concept
notation: 2195
preferred label: Astronomy @en
related: Ηλιακά ρολόγια

Ηλιακά ρολόγια
type: Concept
contributor: Κατσιαδάκη Ελένη (ΑΑ)
contributor: Katsiadakis Helen (AA) @en
created: 2020-08-20
creator: Μεργούπη-Σαβαΐδου Ειρήνη (ΑΑ)
creator: Mergoupi-Savaidou Eirini (AA) @en
modified: 2020-08-24
source: Genuth 2011
status: Εκδοθείς
broader: Επιστημονικά όργανα
in scheme: HUMANITIES-THESAURUS
notation: 2605
preferred label: Sundials @en
related: Αστρονομία
scope note: Instruments that determine the local time by means of a shadow cast by a gnomon onto a surface marked in hours. Sundials date back to Antiquity, but became especially popular between the 16th and 19th centuries for checking if mechanical clocks, which were becoming more and more common, were keeping correct time. @en
scope note: Όργανα που καθορίζουν την τοπική ώρα, χρησιμοποιώντας τη σκιά ενός γνώμονα που πέφτει σε μια επιφάνεια πάνω στην οποία έχουν σημειωθεί οι ώρες. Τα ηλιακά ρολόγια χρονολογούνται από την αρχαιότητα, αλλά έγιναν ιδιαιτέρως δημοφιλή μεταξύ του 16ου και του 18ου αιώνα για να ελέγχουν αν τα μηχανικά ρολόγια, που χρησιμοποιούνταν ολοένα και περισσότερο, κρατούσαν σωστή ώρα.