HUMANITIES-THESAURUS
type: ConceptScheme

Προτασιακά αντικείμενα
type: Concept
narrower: Παραμύθια
notation: 25
preferred label: Propositional objects @en

Παραμύθια
type: Concept
contributor: Katsiadakis Helen (AA) @en
contributor: Κατσιαδάκη Ελένη (ΑΑ)
created: 2015-04-21
creator: Souyioultzoglou Iraklitos (AA) @la
creator: Σουγιουλτζόγλου Ηράκλειτος (ΑΑ)
modified: 2020-08-30
source: Zipes 2013
status: Εκδοθείς
broader: Προτασιακά αντικείμενα
in scheme: HUMANITIES-THESAURUS
notation: 260
preferred label: Fairy tales @en
related: Λαογραφία
scope note: Σύντομες διδακτικές ιστορίες με αλληγορικές αναφορές που εκτυλίσσονται σε διαδοχικά επεισόδια και αφηγούνται τις περιπέτειες φανταστικών χαρακτήρων, ενσωματώνοντας στοιχεία του φυσικού και του υπεφυσικού κόσμου.
scope note: EN: Short educational stories with allegorical connotations that unfold in consecutive acts and feature imaginary characters as well as elements of the natural and supernatural realms. @en

Λαογραφία
type: Concept
notation: 613
preferred label: Folkloristics @en
related: Παραμύθια