HUMANITIES-THESAURUS
type: ConceptScheme

Seismology
type: Concept
notation: 2520
preferred label: Σεισμολογία @el
related: Standardisation

Standardisation
type: Concept
contributor: Katsiadakis Helen (AA)
contributor: Κατσιαδάκη Ελένη (ΑΑ) @el
created: 2020-08-04
creator: Μεργούπη-Σαβαΐδου Ειρήνη (ΑΑ) @el
creator: Mergoupi-Savaidou Eirini (AA)
modified: 2020-08-24
source: Lagerstrom 2003
status: Εκδοθείς
broader: Procedures
in scheme: HUMANITIES-THESAURUS
notation: 2599
preferred label: Προτυποποίηση @el
related: Seismology
scope note: The establishment of specifications for the measurement, design, and performance of processes and products of science, technology and industry, or society in general. These specifications are either administered voluntarily or enforced by some authority, and apply at a national or international level.
scope note: Η εδραίωση προδιαγραφών για τη μέτρηση, τον σχεδιασμό και τη λειτουργία διαδικασιών και προϊόντων της επιστήμης, της τεχνολογίας, της βιομηχανίας, η γενικότερα της κοινωνίας. Οι προδιαγραφές αυτές είτε εφαρμόζονται οικειοθελώς είτε επιβάλλονται από κάποια αρχή, και ισχύουν σε εθνικό ή διεθνές επίπεδο. @el

Procedures
type: Concept
narrower: Standardisation
notation: 285
preferred label: Διαδικασίες @el