HUMANITIES-THESAURUS
type: ConceptScheme

Σχήματα λόγου
type: Concept
narrower: Ομοιοτέλευτο
notation: 1659
preferred label: Figures of speech @en

Ομοιοτέλευτο
type: Concept
contributor: Katsiadakis Helen (AA) @en
contributor: Κατσιαδάκη Ελένη (ΑΑ)
created: 2020-06-25
creator: Kalafata Patritsia (AA) @la
creator: Καλαφατά Πατρίτσια (ΑΑ)
modified: 2020-10-19
source: Liddell & Scott 1940
source: Μπίλλα 2010
status: Εκδοθείς
alternative label: Ομοιοκατάληκτο
broader: Σχήματα λόγου
in scheme: HUMANITIES-THESAURUS
notation: 2546
preferred label: Omoioteleuton @en
scope note: Similarity of endings of adjacent or parallel words. This figure is often combined with alliteration in accentuating the rhythm of parallel members. @en
scope note: Σχήμα λόγου κατά το οποίο δύο διαδοχικές φράσεις, προτάσεις ή στίχοι τελειώνουν με λέξεις που έχουν την ίδια κατάληξη. Σε συνδυασμό με άλλα σχήματα λόγου, όπως η παρήχηση, επαυξάνει την αίσθηση ρυθμού στον γραπτό ή προφορικό λόγο.