HUMANITIES-THESAURUS
type: ConceptScheme

Σχήματα λόγου
type: Concept
narrower: Πρωθύστερο (σχήμα λόγου)
notation: 1659
preferred label: Figures of speech @en

Πρωθύστερο (σχήμα λόγου)
type: Concept
contributor: Katsiadakis Helen (AA) @fr
contributor: Κατσιαδάκη Ελένη (ΑΑ)
created: 2020-06-25
creator: Kalafata Patritsia (AA) @la
creator: Καλαφατά Πατρίτσια (ΑΑ)
modified: 2020-10-19
source: Λεξικό της κοινής νεοελληνικής 1998
source: Liddell & Scott 1940
status: Εκδοθείς
broader: Σχήματα λόγου
in scheme: HUMANITIES-THESAURUS
notation: 2544
preferred label: Ηindmost foremost @en
scope note: Α figure of speech in which we first mention an act or a concept to emphasize it, while another relevant one should have preceded it. @en
scope note: Σχήμα λόγου κατά το οποίο για λόγους έμφασης προτάσσεται στον λόγο αυτό που χρονικά και λογικά θα έπρεπε να ακολουθεί και να επιτάσσεται. Π.χ. «Τέλος κι αρχήν η μνήμη εδώ δεν έχει».