HUMANITIES-THESAURUS
type: ConceptScheme

Pentakosiomedimnoi
type: Concept
contributor: Katsiadakis Helen (AA)
contributor: Κατσιαδάκη Ελένη (ΑΑ) @el
created: 2020-05-29
creator: Χρυσοβιτσάνος Γεράσιμος (ΑΑ) @el
creator: Chrysovitsanos Gerasimos (AA) @fr
modified: 2020-10-10
source: Gomme, Cadoux & Rhodes 2012a
status: Εκδοθείς
alternative label: Five-hundred-bushel men
broader: Collectivities and groups
in scheme: HUMANITIES-THESAURUS
notation: 2504
preferred label: Πεντακοσιομέδιμνοι @el
scope note: One of the four classes in which Athenian citizens were divided from the 6th century BC according to the income their property could generate. The class of pentakosiomedimnoi consisted of citizens whose land yielded at least 500 medimnoi of corn or the equivalent in other produce. Initially, archons were chosen among citizens from this class. Later members of other classes could also hold senior offices.
scope note: Μία από τις τέσσερις τάξεις στις οποίες διαιρούνταν οι Αθηναίοι πολίτες από τον 6ο αιώνα π.Χ. ανάλογα με το εισόδημα που μπορούσε να αποφέρει η περιουσία τους. Στην τάξη των πεντακοσιομέδιμνων ανήκαν πολίτες των οποίων η γη μπορούσε να αποδώσει τουλάχιστον 500 μεδίμνους καλαμποκιού ή άλλου καρπού. Αρχικά επιλέγονταν οι άρχοντες μόνο από αυτή την τάξη, αργότερα μπορούσαν να κατέχουν ανώτερα αξιώματα και μέλη των άλλων τάξεων. @el

Collectivities and groups
type: Concept
narrower: Pentakosiomedimnoi
notation: 26
preferred label: Συλλογικότητες και ομάδες @el