HUMANITIES-THESAURUS
type: ConceptScheme

Συμβολισμός
type: Concept
contributor: Βερναρδάκη Ελένη (ΑΑ)
contributor: Vernardaki Eleni (AA) @fr
created: 2015-10-14
creator: Ξηροπαϊδης Γιώργος (ΑΣΚΤ)
creator: Xiropaidis Georgios (ASFA) @de
modified: 2019-11-20
source: Πανεπιστήμιο της Οξφόρδης 1998
source: Clarke 2001
source: Λυδάκης 2009
source: Frazier 2000
source: Ρηντ κ.ά. 1986
status: Εκδοθείς
broader: Καλλιτεχνικά ρεύματα
in scheme: HUMANITIES-THESAURUS
notation: 249
preferred label: Symbolism @en
scope note: Χαλαρά οργανωμένο καλλιτεχνικό κίνημα, άμεσα συνδεδεμένο με το συμβολιστικό κίνημα της γαλλικής ποίησης, που άνθησε κατά τις δεκαετίες 1880 και 1890. Γεννήθηκε ως αντίδραση στους νατουραλιστικούς στόχους του Ιμπρεσιονισμού και ακόμη περισσότερο στις αρχές του Ρεαλισμού. Οι Συμβολιστές επιχείρησαν να δώσουν εικαστική έκφραση στο μυστικιστικό και στο απόκρυφο.
scope note: From c. 1880 to c. 1900, following and in contrast to Realism and Impressionism, Symbolism was a movement in literature as well as the visual arts. In ways an expression of Romanticism, Symbolism was also subjective and emotional rather than objective and detached. @en

Καλλιτεχνικά ρεύματα
type: Concept
narrower: Συμβολισμός
notation: 27