HUMANITIES-THESAURUS
type: ConceptScheme

Συμμορίαι (Αρχαία Ελλάδα)
type: Concept
notation: 2485
preferred label: Symmoriai (Ancient Greece) @en
related: Προεισφοραί (Αρχαία Ελλάδα)

Εισφοραί (Αρχαία Ελλάδα)
type: Concept
notation: 2486
preferred label: Eisphorai (Ancient Greece) @en
related: Προεισφοραί (Αρχαία Ελλάδα)

Προεισφοραί (Αρχαία Ελλάδα)
type: Concept
contributor: Κατσιαδάκη Ελένη (ΑΑ)
contributor: Katsiadakis Helen (AA) @en
created: 2020-05-26
creator: Χρυσοβιτσάνος Γεράσιμος (ΑΑ)
creator: Chrysovitsanos Gerasimos (AA) @fr
modified: 2020-10-10
source: Heichelheim & Rhodes 2012b
status: Εκδοθείς
broader: Προτασιακά αντικείμενα
in scheme: HUMANITIES-THESAURUS
notation: 2487
preferred label: Proeisforai (Ancient Greece) @en
related: Συμμορίαι (Αρχαία Ελλάδα)
related: Εισφοραί (Αρχαία Ελλάδα)
scope note: A type of irregular taxation that was imposed after 378 BC on the three wealthiest Athenians of each tax group (symmoria) who were invited to prepay the whole sum that corresponded to their symmoria as an advance payment (proeisphora), and were left to reimburse themselves from the other members. @en
scope note: Τύπος έκτακτης φορολόγησης η οποία μετά το 378 π.Χ. επιβάλλονταν στους τρεις ευπορότερους Αθηναίους κάθε φορολογικής ομάδας (συμμορίας) οι οποίοι καλούνταν να προκαταβάλουν το συνολικό ποσό του φόρου που αντιστοιχούσε σε όλα τα μέλη της συμμορίας στην οποία ανήκαν. Κατόπιν οι ίδιοι είχαν τη μέριμνα για την αποζημίωσή τους από τα υπόλοιπα μέλη της συμμορίας.

Προτασιακά αντικείμενα
type: Concept
narrower: Προεισφοραί (Αρχαία Ελλάδα)
notation: 25
preferred label: Propositional objects @en