HUMANITIES-THESAURUS
type: ConceptScheme

Concordia
type: Concept
contributor: Κατσιαδάκη Ελένη (ΑΑ)
contributor: Katsiadakis Helen (AA) @en
created: 2015-04-04
creator: Georgopoulos Theodoros (UOA) @la
creator: Γεωργόπουλος Θεόδωρος (ΕΚΠΑ)
modified: 2020-07-07
source: Κουμανούδης 1884
source: Hölscher 2005
status: Εκδοθείς
broader: Προτασιακά αντικείμενα
in scheme: HUMANITIES-THESAURUS
notation: 235
scope note: Concordia, -ae (λατιν.)> ομόνοια, αρμονία. Παράσταση που συμβολίζει στα δημόσια ανάγλυφα την ομοψυχία που διαπνέει τον αυτοκράτορα με το λαό, παρουσιάζοντας π.χ. μια εκφώνηση λόγου, ενώ σε ιδιωτικά ανάγλυφα, όπως σε σαρκοφάγους, μπορεί να απεικονίζεται η σύναψη ενός γάμου.

Προτασιακά αντικείμενα
type: Concept
narrower: Concordia
notation: 25
preferred label: Propositional objects @en