HUMANITIES-THESAURUS
type: ConceptScheme

Ρομαντισμός
type: Concept
contributor: Vernardaki Eleni (AA) @fr
contributor: Βερναρδάκη Ελένη (ΑΑ)
created: 2015-10-14
creator: Ξηροπαϊδης Γιώργος (ΑΣΚΤ)
creator: Xiropaidis Georgios (ASFA) @de
modified: 2019-11-20
source: Ρηντ κ.ά. 1986
source: Frazier 2000
source: Clarke 2001
status: Εκδοθείς
broader: Καλλιτεχνικά ρεύματα
in scheme: HUMANITIES-THESAURUS
notation: 233
preferred label: Romanticism @en
scope note: Κίνημα της τέχνης που εμφανίστηκε στο τέλος του 18ου και στις αρχές του 19ου αιώνα. Βασική αρχή του είναι η πίστη στην αξία της έκφρασης του ατομικού βιώματος. Η θέση του αυτή τον αντιδιαστέλλει με τον ορθολογισμό του Διαφωτισμού και την τάξη του Nεοκλασικισμού.
scope note: A broad cultural manifestation that can be seen simply as a late 18th- to early 19th-century reaction against the reason of the Enlightenment and the order of Neoclassicism. Implicit to this process were beliefs in the primacy of individual experience and in the irrational as well the rational. @en

Καλλιτεχνικά ρεύματα
type: Concept
narrower: Ρομαντισμός
notation: 27