HUMANITIES-THESAURUS
type: ConceptScheme

Κλήρωσις εκ προκρίτων
type: Concept
contributor: Κατσιαδάκη Ελένη (ΑΑ)
contributor: Katsiadakis Helen (AA) @en
created: 2020-02-10
creator: Chrysovitsanos Gerasimos (AA) @fr
creator: Χρυσοβιτσάνος Γεράσιμος (ΑΑ)
modified: 2020-06-08
source: Μπιργάλιας 2007a
status: Εκδοθείς
broader: Διαδικασίες
in scheme: HUMANITIES-THESAURUS
notation: 2321
preferred label: Klerosis ek prokriton @en
scope note: Type of lottery that appeared in the 5th century BC. in Athens. This system combined election and lottery. For example, it was used for the election of the nine archons; candidates for the offices of the archons were elected from each tribe (ten first, one hundred later), and among them, a lottery was held to determine who would assume the office. @en
scope note: Τύπος κλήρωσης που διενεργούνταν κατά τον 5ο αιώνα π.Χ. στην Αθήνα. Το σύστημα αυτό συνδύαζε την εκλογή και την κλήρωση. Μία από τις περιπτώσεις που χρησιμοποιούνταν ήταν η επιλογή των εννέα αρχόντων· οι υποψήφιοι για τις θέσεις των αρχόντων εκλέγονταν από κάθε φυλή (δέκα τον αριθμό αρχικά, εκατό αργότερα), στη συνέχεια μεταξύ αυτών γινόταν κλήρωση για την ανάληψη του αξιώματος.

Διαδικασίες
type: Concept
narrower: Κλήρωσις εκ προκρίτων
notation: 285
preferred label: Procedures @en