HUMANITIES-THESAURUS
type: ConceptScheme

Πανταλόνε
type: Concept
contributor: Vernardaki Eleni (AA) @fr
contributor: Βερναρδάκη Ελένη (ΑΑ)
created: 2020-01-31
creator: Goulis Helen (AA) @la
creator: Γουλή Ελένη (ΑΑ)
modified: 2020-10-06
source: Henke 2002
source: Rudlin 1994
source: Σιδηροπούλου 2015
status: Εκδοθείς
broader: Ηλικιωμένοι (τύπος)
in scheme: HUMANITIES-THESAURUS
notation: 2306
preferred label: Pantalone @de
preferred label: Pantalon @fr
scope note: Pantalone is the most prominent representative of the elderly types of Commedia dell’ arte, depicting the Venetian merchant. Jealous, stingy, and bitter, he derives his origin from the senex in Roman comedy and reproduces all the frailties of the elderly of every age and of his society. Strict and adherent of the absolute paternal authority in the family, a cunning husband, he relents in the end and accepts the love choice of his child. Respectful towards the priests and practicing confession, he secretly maintains a flexible and convenient morality, lending money with enormous interest or squandering it on mistresses. @en
scope note: Ο Πανταλόνε είναι ο κατεξοχήν εκπρόσωπος των ηλικιωμένων τύπων της Κομέντια ντελ άρτε. Στο πρόσωπο εκπροσωπείται ο Βενετσιάνος έμπορος. Ζηλιάρης, τσιγκούνης και πικρόχολος, έχει πρόγονό του τον senex της ρωμαϊκής κωμωδίας και αναπαράγει όλες τις αδυναμίες των ηλικιωμένων κάθε εποχής αλλά και της κοινωνίας του: αυστηρός και οπαδός της απόλυτης πατρικής εξουσίας στην οικογένεια, πονηρός σύζυγος, υποχωρεί στο τέλος και αποδέχεται τον έρωτα του παιδιού του. Ευλαβικός με τους ιερείς και φανατικός της εξομολόγησης, διατηρεί κρυφά μια ιδιαίτερα ελαστική και βολική ηθική, δανείζοντας με υπέρογκο τόκο χρήματα ή χάνοντάς τα στο κρεβάτι μιας ερωμένης.

Ηλικιωμένοι (τύπος)
type: Concept
narrower: Πανταλόνε
notation: 2563
preferred label: Vecchi @fr