HUMANITIES-THESAURUS
type: ConceptScheme

Πολιτικά αξιώματα
type: Concept
narrower: Ορκωτής (περίοδος πόλης κράτους)
notation: 1696
preferred label: Political offices @en

Ορκωτής (περίοδος πόλης κράτους)
type: Concept
contributor: Κατσιαδάκη Ελένη (ΑΑ)
contributor: Katsiadakis Helen (AA) @en
created: 2020-01-28
creator: Χρυσοβιτσάνος Γεράσιμος (ΑΑ)
creator: Chrysovitsanos Gerasimos (AA) @fr
modified: 2020-10-10
source: Κουμανούδης & Ματθαίου 1986
status: Εκδοθείς
broader: Πολιτικά αξιώματα
in scheme: HUMANITIES-THESAURUS
notation: 2262
preferred label: Horkotis (city-state period) @en
scope note: Αξίωμα που απαντά στην αρχαία Ελλάδα. Οι ορκωταί ήταν πολίτες που δέχονταν τους όρκους μιας άλλης πόλης, όταν οι πόλεις συνήπταν συνθήκες συμμαχίας.
scope note: An office that appears in ancient Athens. The horkotai were citizens who accepted the oaths of another city when the cities were forming an alliance. @en