HUMANITIES-THESAURUS
type: ConceptScheme

Τουρισμός
type: Concept
narrower: Μαζικός τουρισμός
notation: 2249
preferred label: Tourism @en

Μαζικός τουρισμός
type: Concept
contributor: Katsiadakis Helen (AA) @en
contributor: Κατσιαδάκη Ελένη (ΑΑ)
created: 2020-01-24
creator: Tzedopoulos Giorgos (AA) @de
creator: Τζεδόπουλος Γιώργος (ΑΑ)
modified: 2020-04-02
source: Pons, Crang, & Travlou 2016
source: Aramberri 2010
status: Εκδοθείς
broader: Τουρισμός
in scheme: HUMANITIES-THESAURUS
notation: 2259
preferred label: Mass tourism @en
scope note: Ομαδικά ταξίδια σε προκαθορισμένους προορισμούς και οργανωμένα από τουριστικές εταιρείες. Ο μαζικός τουρισμός ανάγεται στις παράκτιες πόλεις της Βρετανίας στο δεύτερο μισό του 19ου αιώνα, αλλά αναδείχθηκε σε διεθνές φαινόμενο μετά τον Β΄ Παγκόσμιο Πόλεμο. Η άνοδός του οφειλόταν στη διευκόλυνση των μετακινήσεων μέσω τεχνολογικών καινοτομιών, στην παγίωση συστημάτων κοινωνικής πρόνοιας, στην αύξηση του πραγματικού εισοδήματος των μικροαστικών και εργατικών τάξεων και στη διεύρυνση της πρόσβασης σε ελεύθερο χρόνο. Επεκτείνοντας την αρχή του βιομηχανικού καπιταλισμού και του καταναλωτισμού στο πεδίο του ελεύθερου χρόνου, ο μαζικός τουρισμός εξελίχθηκε σε μια τεράστια παγκόσμια αγορά που επηρέασε σε βάθος τις κοινωνίες, τις πλουτοπαραγωγικές πηγές και το φυσικό περιβάλλον των τουριστικών προορισμών.
scope note: Τravel by groups on pre-scheduled tours organised by tourism companies. Mass tourism originates in the second half of the 19th century in the coastal towns of Britain but became an international phenomenon after World War II. Its rise was due to transport innovations, to the consolidation of a welfare system, to the increase of the middle and working classes' real income, and to the democratisation of leisure time. By extending the principle of industrial capitalism and consumerism to the realm of leisure time, mass tourism has developed to a vast global economy profoundly affecting the societies, the resources and the natural environment of tourist destinations. @en