HUMANITIES-THESAURUS
type: ConceptScheme

Τουρισμός
type: Concept
narrower: Περιπατητικός τουρισμός
notation: 2249
preferred label: Tourism @en

Περιπατητικός τουρισμός
type: Concept
contributor: Κατσιαδάκη Ελένη (ΑΑ)
contributor: Katsiadakis Helen (AA) @en
created: 2020-01-24
creator: Τζεδόπουλος Γιώργος (ΑΑ)
creator: Tzedopoulos Giorgos (AA) @de
modified: 2020-04-02
source: Hall, Ram & Shoval 2017
source: Sheller & Urry 2004
status: Εκδοθείς
broader: Τουρισμός
in scheme: HUMANITIES-THESAURUS
notation: 2258
preferred label: Walking tourism @en
scope note: Μορφή τουρισμού που επικεντρώνεται στην πρακτική της περιπατητικής διέλευσης σε τόπους ιδιαίτερου πολιτιστικού ή/και φυσικού ενδιαφέροντος με στόχο την ενσώματη εμπειρία και την εκ του σύνεγγυς γνωριμία με τον χώρο. Ο περιπατητικός τουρισμός εντάσσεται στην ευρύτερη κατηγορία του "αργού" τουρισμού, που αντιτίθεται στον μαζικό τουρισμό και δίνει έμφαση στη διενέργεια ταξιδιών με φιλικούς προς το περιβάλλον και οικονομικά βιώσιμους τρόπους.
scope note: Form of tourism centered on the practice of peripatetic walking in sites of cultural and/or natural interest that aims at embodied experience and close acquaintance with the place. Walking tourism is included in the wider category of "slow" tourism which, in contrast to mass tourism, emphasises traveling in environmentally friendly and economically sustainable ways. @en