HUMANITIES-THESAURUS
type: ConceptScheme

Παροχή γνώσης/τεχνογνωσίας
type: Concept
narrower: Θερμαλισμός
notation: 157
preferred label: Provision of knowledge and expertise @en

Θερμαλισμός
type: Concept
contributor: Katsiadakis Helen (AA) @en
contributor: Κατσιαδάκη Ελένη (ΑΑ)
created: 2020-01-24
creator: Tzedopoulos Giorgos (AA) @de
creator: Τζεδόπουλος Γιώργος (ΑΑ)
modified: 2020-04-02
source: Tzedopoulos, Kamara, Lampada, & Ferla 2018
source: Naraindas & Bastos 2015
status: Εκδοθείς
broader: Παροχή γνώσης/τεχνογνωσίας
in scheme: HUMANITIES-THESAURUS
notation: 2247
preferred label: Thermalism @en
scope note: Specialisation in the theory, practice, and services concerning the use of thermal springs for therapy and wellness. The formation of a thermalist theory and practice dates back to Greco-Roman antiquity. Since the 19th century, thermalism was organised medicinally and became a distinct category of therapeutic treatments for several ilnesses and of wellness tourism. @en
scope note: Ειδίκευση στη θεωρία, την πράξη, την ανέγερση εγκαταστάσεων και την παροχή υπηρεσιών σχετικά με τη χρήση θερμών πηγών για ίαση και ευεξία. Η διαμόρφωση μιας συγκροτημένης θερμαλιστικής θεωρίας και πρακτικής χρονολογείται από την ελληνορωμαϊκή αρχαιότητα. Από τον 19ο αιώνα ο θερμαλισμός οργανώθηκε στο πλαίσιο της ιατρικής επιστήμης και αποτέλεσε ιδιαίτερη κατηγορία θεραπευτικής αγωγής και τουρισμού ευεξίας.