HUMANITIES-THESAURUS
type: ConceptScheme

Λειτουργίες
type: Concept
narrower: Επινοημένες παραδόσεις
notation: 21
preferred label: Functions @en

Επινοημένες παραδόσεις
type: Concept
contributor: Κατσιαδάκη Ελένη (ΑΑ)
contributor: Katsiadakis Helen (AA) @en
created: 2020-01-24
creator: Τζεδόπουλος Γιώργος (ΑΑ)
creator: Tzedopoulos Giorgos (AA) @de
modified: 2020-04-02
source: Hobsbawm & Ranger 1983
status: Εκδοθείς
broader: Λειτουργίες
in scheme: HUMANITIES-THESAURUS
notation: 2245
preferred label: Invented traditions @en
scope note: Σύνολα πρακτικών που δημιουργούνται με μεγαλύτερη ή μικρότερη αυθαιρεσία για να υποστηρίξουν μια αδιάσπαστη συνέχεια με το παρελθόν. Οι επινοημένες παραδόσεις επιβάλλουν συγκεκριμένες αξίες και νόρμες συμπεριφοράς νομιμοποιώντας τες ως αυθεντικές εκφράσεις ιστορικής συνέχειας με στόχο την πραγματοποίηση κοινωνικών και πολιτισμικών επιδιώξεων και στόχων.
scope note: Sets of practices created more or less arbitrarily in order to support an unbroken continuity with the past. Invented traditions impose specific values and norms of behaviour by legitimising them as authentic expressions of historical continuity in order to fulfill social and cultural aspirations and aims. @en