HUMANITIES-THESAURUS
type: ConceptScheme

Συστήματα επικοινωνίας
type: Concept
narrower: Τεχνικά συστήματα επικοινωνίας
notation: 2158
preferred label: Communication systems @en

Τεχνικά συστήματα επικοινωνίας
type: Concept
contributor: Κατσιαδάκη Ελένη (ΑΑ)
contributor: Katsiadakis Helen (AA) @en
created: 2020-01-14
creator: Καρασίμος Αθανάσιος (ΑΑ)
creator: Karasimos Athanasios (AA) @la
modified: 2020-10-19
source: Society of American Archivists 2013
status: Εκδοθείς
broader: Συστήματα επικοινωνίας
in scheme: HUMANITIES-THESAURUS
notation: 2227
preferred label: Technical communication systems @en
scope note: Η τεχνική επικοινωνία είναι ευρύ πεδίο και περιλαμβάνει κάθε μορφή επικοινωνίας που παρουσιάζει ένα ή περισσότερα από τα ακόλουθα χαρακτηριστικά: Επικοινωνία με τεχνικά ή εξειδικευμένα θέματα, όπως εφαρμογές πληροφορικής, ιατρικές διαδικασίες ή περιβαλλοντικούς κανονισμούς, επικοινωνία με τη χρήση τεχνολογίας, όπως ιστοσελίδες, αρχεία βοήθειας ή ιστότοποι κοινωνικής δικτύωσης. Παρέχοντας οδηγίες σχετικά με το πώς να κάνετε κάτι, ανεξάρτητα από το πόσο τεχνική είναι η εργασία ή ακόμα και αν χρησιμοποιείται τεχνολογία για τη δημιουργία ή τη διανομή αυτής της επικοινωνίας. Η αξία που παρέχουν τα τεχνικά συστήματα επικοινωνίας είναι διπλή, μιας και κάνουν τις πληροφορίες πιο χρήσιμες και προσβάσιμες σε όσους χρειάζονται αυτές τις πληροφορίες και με αυτόν τον τρόπο προωθούν τους στόχους των εταιρειών ή των οργανισμών που τους απασχολούν.
scope note: Technical communication is a broad field and includes any form of communication that exhibits one or more of the following characteristics: communicating about technical or specialised topics, such as computer applications, medical procedures, or environmental regulations; communicating by using technology, such as web pages, help files, or social media sites; providing instructions about how to do something, regardless of how technical the task is or even if the technology is used to create or distribute that communication. The value that technical communicators deliver is twofold: They make information more useable and accessible to those who need that information, and in doing so, they advance the goals of the companies or organisations that employ them. @en