HUMANITIES-THESAURUS
type: ConceptScheme

Techincal languages
type: Concept
narrower: Engineered languages
notation: 2159
preferred label: Τεχνητές γλώσσες @el

Engineered languages
type: Concept
contributor: Κατσιαδάκη Ελένη (ΑΑ) @el
contributor: Katsiadakis Helen (AA)
created: 2020-01-10
creator: Karasimos Athanasios (AA) @de
creator: Καρασίμος Αθανάσιος (ΑΑ) @el
modified: 2020-08-21
source: Meaney, Trinick & Fairhall 2013
status: Εκδοθείς
alternative label: Engilangs
alternative label: Engelangs
broader: Techincal languages
in scheme: HUMANITIES-THESAURUS
notation: 2213
preferred label: Μηχανικές γλώσσες @el
scope note: Engineered languages are constructed languages devised to test or prove some hypotheses about how languages work or might work. There are at least three subcategories, philosophical languages (or ideal languages), logical languages (sometimes abbreviated as loglangs), and experimental languages. Raymond Brown describes engineered languages as "languages that are designed to specified objective criteria, and modeled to meet those criteria". Some engineered languages have been considered candidate global auxiliary languages, and some languages intended as international auxiliary languages have certain engineered aspects.
scope note: Οι μηχανικές γλώσσες είναι κατασκευασμένες γλώσσες που σχεδιάστηκαν για να δοκιμάσουν ή να αποδείξουν μερικές υποθέσεις σχετικά με το πώς λειτουργούν ή θα λειτουργούσαν οι γλώσσες. Υπάρχουν τουλάχιστον τρεις υποκατηγορίες, φιλοσοφικές γλώσσες, λογικές γλώσσες και πειραματικές γλώσσες. Ο Raymond Brown περιγράφει τις λεγόμενες μηχανικές γλώσσες ως "γλώσσες που έχουν σχεδιαστεί για να καθορίσουν αντικειμενικά κριτήρια και έχουν σχεδιαστεί για να πληρούν αυτά τα κριτήρια". Ορισμένες μηχανικές γλώσσες θεωρούνται υποψήφιες παγκόσμιες βοηθητικές γλώσσες και ορισμένες γλώσσες που προορίζονται ως διεθνείς βοηθητικές γλώσσες έχουν συγκεκριμένες τεχνικές πτυχές. @el