HUMANITIES-THESAURUS
type: ConceptScheme

Πολιτικά αξιώματα
type: Concept
narrower: Επίσκοπος (περίοδος πολης-κράτους)
notation: 1696
preferred label: Political offices @en

Επίσκοπος (περίοδος πολης-κράτους)
type: Concept
contributor: Katsiadakis Helen (AA) @en
contributor: Κατσιαδάκη Ελένη (ΑΑ)
created: 2019-12-30
creator: Chrysovitsanos Gerasimos (AA) @la
creator: Χρυσοβιτσάνος Γεράσιμος (ΑΑ)
modified: 2020-06-08
source: Ραμού-Χαψιάδη 2007a
status: Εκδοθείς
broader: Πολιτικά αξιώματα
in scheme: HUMANITIES-THESAURUS
notation: 2200
preferred label: Episkopos (city-state period) @en
related: Φρούραρχος (περίοδος πόλης-κράτους)
scope note: The episkopoi were annual magistrates appointed by lot and sent to the cities in the Delian Confederacy to sit in judgement on differences that arose out of the implementation of the treaties. @en
scope note: Οι επίσκοποι ήταν κληρωτοί άρχοντες με ετήσια θητεία και εκπροσωπούσαν τους Αθηναίους στις πόλεις της Δηλιακής Συμμαχίας ως κριτές για τις τυχόν διαφορές που προέκυπταν από την εφαρμογή των συνθηκών.

Φρούραρχος (περίοδος πόλης-κράτους)
type: Concept
notation: 2289
preferred label: Phrourarchos (city-state period) @en
related: Επίσκοπος (περίοδος πολης-κράτους)