HUMANITIES-THESAURUS
type: ConceptScheme

Γραφή
type: Concept
narrower: Γραφή ύβρεως
notation: 2167
preferred label: Graphe @en

Γραφή ύβρεως
type: Concept
contributor: Katsiadakis Helen (AA) @en
contributor: Κατσιαδάκη Ελένη (ΑΑ)
created: 2019-11-28
creator: Chrysovitsanos Gerasimos (AA) @fr
creator: Χρυσοβιτσάνος Γεράσιμος (ΑΑ)
modified: 2020-10-19
source: Glotz 1994
status: Εκδοθείς
broader: Γραφή
in scheme: HUMANITIES-THESAURUS
notation: 2170
preferred label: Graphe yvreos @en
scope note: A legal procedure that occured in ancient Athens. Through the graphe yvreos any citizen could bring a public prosecution against someone who deliberately insulted the honor and reputation of a man or woman, free or slave. @en
scope note: Διαδικασία νομικής φύσεως που απαντά στην αρχαία Αθήνα. Με τη γραφή ύβρεως μπορούσε οποιοσδήποτε πολίτης να ασκήσει δίωξη με δημόσια αγωγή σε κάποιον που σκοπίμως προσέβαλε την τιμή και την υπόληψη ενός άνδρα ή γυναίκας, ελεύθερου η δούλου.