HUMANITIES-THESAURUS
type: ConceptScheme

Κυβισμός
type: Concept
contributor: Vernardaki Eleni (AA) @fr
contributor: Βερναρδάκη Ελένη (ΑΑ)
created: 2015-10-15
creator: Ξηροπαϊδης Γιώργος (ΑΣΚΤ)
creator: Xiropaidis Georgios (ASFA) @de
modified: 2019-11-20
source: Ρηντ κ.ά. 1986
source: Πανεπιστήμιο της Οξφόρδης 1997
source: Frazier 2000
source: Clarke 2001
status: Εκδοθείς
broader: Καλλιτεχνικά ρεύματα
in scheme: HUMANITIES-THESAURUS
notation: 217
preferred label: Cubism @en
scope note: Κίνημα της ζωγραφικής και λιγότερο της γλυπτικής. Εμφανίστηκε το 1907 περίπου και θεωρείται από τους σημαντικότερους σταθμούς της δυτικής τέχνης. Οι Κυβιστές ήθελαν να περιγράψουν τα αντικείμενα όπως αυτά είναι γνωστά, παρά όπως εμφανίζονται σε μια συγκεκριμένη στιγμή και σε έναν συγκεκριμένο χώρο. Γι’ αυτό διέλυσαν τις φόρμες σε μία πληθώρα από όψεις, αποφεύγοντας να τις περιγράψουν από μια συγκεκριμένη γωνία. Έτσι, πολλές διαφορετικές όψεις του ίδιου αντικειμένου αναπαριστάνονταν ταυτοχρόνως. Ο Κυβισμός είχε ατελείωτες δυνατότητες προσαρμογής και αποτέλεσε το έναυσμα για τη δημιουργία πολλών άλλων κινημάτων, όπως ο Φουτουρισμός και ο Κονστρουκτιβισμός.
scope note: Generally acknowledged to have been the most significant movement in 20th-century art, Cubism was created in the period 1907-1914. It abandoned the traditional fixed viewpoint which had dominated western painting since the Renaissance, and instead explored a multiplicity of viewpoints to develop an accumulated idea of the subject. Among the movements which took Cubism as a starting point or an essential component were Constructivism and Futurism. @en

Καλλιτεχνικά ρεύματα
type: Concept
narrower: Κυβισμός
notation: 27