HUMANITIES-THESAURUS
type: ConceptScheme

Κατάλογοι (Επιγραφές δημοσίου χαρακτήρα)
type: Concept
narrower: Κατάλογοι πεσόντων
notation: 1093
preferred label: Catalogues (Public inscriptions) @en

Κατάλογοι πεσόντων
type: Concept
contributor: Κατσιαδάκη Ελένη (ΑΑ)
contributor: Katsiadakis Helen (AA) @en
created: 2019-11-07
creator: Χρυσοβιτσάνος Γεράσιμος (ΑΑ)
creator: Chrysovitsanos Gerasimos (AA) @fr
modified: 2020-04-28
source: Bradeen 1967
source: Οικονομάκη & Τζιφόπουλος 2015
status: Εκδοθείς
broader: Κατάλογοι (Επιγραφές δημοσίου χαρακτήρα)
in scheme: HUMANITIES-THESAURUS
notation: 2161
preferred label: Casualty lists @en
scope note: Inscriptions containing lists of names of men fallen in battles. It was common for these lists to be used as funerary inscriptions erected by decision of the Council and the Assembly. @en
scope note: Επιγραφές που περιέχουν καταλόγους με ονόματα πεσόντων σε μάχες. Ήταν σύνηθες το φαινόμενο οι κατάλογοι αυτοί να αποτελούν και επιτύμβιες επιγραφές που ανεγείρονταν με απόφαση της Βουλής και της εκκλησίας του Δήμου.