HUMANITIES-THESAURUS
type: ConceptScheme

Communication systems
type: Concept
narrower: Techincal languages
notation: 2158
preferred label: Συστήματα επικοινωνίας @el

Techincal languages
type: Concept
contributor: Κατσιαδάκη Ελένη (ΑΑ) @el
contributor: Katsiadakis Helen (AA)
created: 2019-11-06
creator: Karasimos Athanasios (AA) @fr
creator: Καρασίμος Αθανάσιος (ΑΑ) @el
modified: 2020-11-11
source: Eco 1995
source: Καρασίμος 2018
status: Εκδοθείς
alternative label: Artificial languages
alternative label: Non-human languages
alternative label: Constructed languages
alternative label: Μη-ανθρώπινες γλώσσες @el
broader: Communication systems
in scheme: HUMANITIES-THESAURUS
narrower: A posteriori languages
narrower: Engineered languages
notation: 2159
preferred label: Τεχνητές γλώσσες @el
scope note: Τεχνητή ή κατασκευασμένη γλώσσα είναι το σύστημα επικοινωνίας του οποίου η γραμματική και το λεξιλόγιο, έχουν επινοηθεί συνειδητά από ένα άτομο ή μια ομάδα, αντί να έχουν εξελιχθεί φυσικά. Υπάρχουν πολλοί πιθανοί λόγοι για να δημιουργηθεί μια τεχνητή γλώσσα: από το να διευκολύνει την ανθρώπινη επικοινωνία, μέχρι να φέρει έναν φανταστικό ή κατασκευασμένο κόσμο στην ζωή. Επίσης για τον γλωσσικό πειραματισμό ή για λόγους καλλιτεχνικής δημιουργίας και έκφρασης. Τέλος μπορεί να δημιουργηθεί για γλωσσικά παιχνίδια. @el
scope note: A constructed language (sometimes called a conlang) is a language whose phonology, grammar, and vocabulary, instead of having developed naturally, are consciously devised. Constructed languages may also be referred to as artificial languages, planned languages or invented languages and in some cases fictional languages. Planned languages are languages that have been purposefully designed. They are the result of deliberate controlling intervention, thus of a form of language planning.

A posteriori languages
type: Concept
broader: Techincal languages
notation: 2185
preferred label: A posteriori τεχνητές γλωσσες @el

Engineered languages
type: Concept
broader: Techincal languages
notation: 2213
preferred label: Μηχανικές γλώσσες @el