HUMANITIES-THESAURUS
type: ConceptScheme

Τεχνικές αποτύπωσης επιγραφών
type: Concept
narrower: Επίθετη τεχνική επιγραφών
notation: 2097
preferred label: Imprint styles of incriptions @en

Επίθετη τεχνική επιγραφών
type: Concept
contributor: Κατσιαδάκη Ελένη (ΑΑ)
contributor: Katsiadakis Helen (AA) @en
created: 2019-10-31
creator: Chrysovitsanos Gerasimos (AA) @fr
creator: Χρυσοβιτσάνος Γεράσιμος (ΑΑ)
modified: 2020-04-28
source: Οικονομάκη & Τζιφόπουλος 2015
status: Εκδοθείς
broader: Τεχνικές αποτύπωσης επιγραφών
in scheme: HUMANITIES-THESAURUS
notation: 2151
preferred label: Εpithesis technique of inscriptions @en
scope note: Τεχνική αποτύπωσης επιγραφών σε αγγεία με την οποία τα γράμματα σχηματίζονται από το ίδιο το υλικό που είναι φτιαγμένο το αγγείο και εμφανίζονται έκτυπα στην επιφάνειά του. Κατά τη ρωμαϊκή περίοδο εφαρμοζόταν παρόμοια τεχνική προσμόζοντας γράμματα από μέταλλο σε ειδικές οπές πάνω σε δημόσιες επιγραφές μνημειακού χαρακτήρα.
scope note: A technique of imprinting inscriptions on vessels, whereby the letters are formed from the same material that the vessel is made of and appear as prints on its surface. During the Roman period a similar practice of fitting letters made of metal to special holes on monumental public inscriptions was adopted. @en