HUMANITIES-THESAURUS
type: ConceptScheme

Τεχνικές αποτύπωσης επιγραφών
type: Concept
narrower: Γραπτή τεχνική επιγραφών
notation: 2097
preferred label: Imprint styles of incriptions @en

Γραπτή τεχνική επιγραφών
type: Concept
contributor: Katsiadakis Helen (AA) @en
contributor: Κατσιαδάκη Ελένη (ΑΑ)
created: 2019-10-30
creator: Chrysovitsanos Gerasimos (AA) @la
creator: Χρυσοβιτσάνος Γεράσιμος (ΑΑ)
modified: 2020-04-28
source: Οικονομάκη & Τζιφόπουλος 2015
status: Εκδοθείς
broader: Τεχνικές αποτύπωσης επιγραφών
in scheme: HUMANITIES-THESAURUS
notation: 2115
preferred label: Dipinti technique of inscriptions @en
scope note: Τεχνική αποτύπωσης επιγραφών στον φορέα γραφής με την οποία το κείμενο ζωγραφίζεται πάνω στην επιφάνεια του αντικειμένου με χρώμα.
scope note: A technique of imprinting inscriptions on the material bearing the inscription, whereby the text is painted on the surface of the object in color. @en