HUMANITIES-THESAURUS
type: ConceptScheme

Εκφυλλοφορία (Αρχαία Ελλάδα)
type: Concept
contributor: Κατσιαδάκη Ελένη (ΑΑ)
contributor: Katsiadakis Helen (AA) @en
created: 2019-10-07
creator: Χρυσοβιτσάνος Γεράσιμος (ΑΑ)
creator: Chrysovitsanos Gerasimos (AA) @fr
modified: 2020-04-06
source: Glotz 1994
status: Εκδοθείς
broader: Διαδικασίες
in scheme: HUMANITIES-THESAURUS
notation: 2074
preferred label: Ekphyllophoria (Ancient Greece) @en
scope note: Τύπος ψηφοφορίας που απαντά στην αρχαία Αθήνα. Κατά την εκφυλλοφορία οι βουλευτές ψήφιζαν για την αποβολή κάποιου βουλευτή από το σώμα της Βουλής με αιτιολογία την τέλεση αξιόποινης πράξης. Για αυτήν την ψηφοφορία χρησιμοποιούσαν φύλλα ελιάς πάνω στα οποία αναγράφονταν η απόφαση του ψηφοφόρου (ΝΑΙ/ΟΧΙ).
scope note: A type of vote that appears in ancient Athens. In the ekphyllophoria, members of the Council voted to expel one of its members on grounds that he had committed a punishable act. The voter's decision (YES/NO) was written on olive leaves. @en

Διαδικασίες
type: Concept
narrower: Εκφυλλοφορία (Αρχαία Ελλάδα)
notation: 285
preferred label: Procedures @en