HUMANITIES-THESAURUS
type: ConceptScheme

Γεωργία
type: Concept
narrower: Αμπελουργία
notation: 148
preferred label: Horticulture @en

Αμπελουργία
type: Concept
contributor: Κατσιαδάκη Ελένη (ΑΑ)
contributor: Katsiadakis Helen (AA) @en
created: 2019-10-02
creator: Φαλιέρου Αναστασία (ΑΑ)
creator: Falierou Anastasia (AA) @en
modified: 2019-10-27
source: Ήμελλου & Πολυμέρου-Καμηλάκη 1983
status: Εκδοθείς
alternative label: Αμπελοκαλλιέργεια
broader: Γεωργία
in scheme: HUMANITIES-THESAURUS
notation: 2064
preferred label: Viticulture @en
scope note: Branch of horticulture which deals with the cultivation of vines. @en
scope note: Κλάδος της γεωργίας που ασχολείται με την καλλιέργεια αμπελιών.