HUMANITIES-THESAURUS
type: ConceptScheme

Πολιτικά αξιώματα
type: Concept
narrower: Μετρονόμος (αρχαία Αθήνα)
notation: 1696
preferred label: Political offices @en

Μετρονόμος (αρχαία Αθήνα)
type: Concept
contributor: Ιακωβίδου Αθηνά (ΑΑ)
contributor: Iakovidou Athena (AA) @la
created: 2019-09-30
creator: Iakovidou Athena (AA) @la
creator: Ιακωβίδου Αθηνά (ΑΑ)
modified: 2020-09-28
source: Σακελλαρίου 2004
source: Lanni 2016
status: Εκδοθείς
broader: Πολιτικά αξιώματα
in scheme: HUMANITIES-THESAURUS
notation: 2053
preferred label: Metronomos (ancient Athens) @en
related: Μετρονόμοι (Συλλογικές αρχές)
scope note: An office that occurs in ancient Athens. They were ten, five for the city and five for Piraeus. Their duty was to ensure the validity of weights and measures in the market. Although we have no direct evidence regarding how these officials enforced the law, it seems likely that they could impose fines up to a specific limit and bring suits just like other market officials. @en
scope note: Αξίωμα που απαντάται στην αρχαία Αθήνα. Ήταν δέκα στον αριθμό και ασκούσαν τα καθήκοντά τους μοιρασμένοι σε δύο ίσα μέρη στην Αθήνα και στον Πειραιά. Αυτοί έλεγχαν αν τα χρησιμοποιούμενα από τους εμπόρους μέτρα και σταθμά ήταν σύμφωνα με τα νόμιμα πρότυπα. Χωρίς να υπάρχουν πληροφορίες σχετικές με τις αρμοδιότητές τους στον τομέα της δικαιοσύνης, είναι πιθανό ότι μπορούσαν να επιβάλουν τιμωρίες ή πρόστιμα έως ένα συγκεκριμένο όριο.

Μετρονόμοι (Συλλογικές αρχές)
type: Concept
notation: 2054
preferred label: Metronomoi (Collective authorities) @en
related: Μετρονόμος (αρχαία Αθήνα)