HUMANITIES-THESAURUS
type: ConceptScheme

Σπουδές (Εικαστικές τέχνες)
type: Concept
contributor: Δασκαλοθανάσης Νίκος (ΑΣΚΤ)
contributor: Daskalothanasis Nikos (ASFA) @de
created: 2019-09-15
creator: Χατζή Μαρία (ΑΣΚΤ)
creator: Chatzi Maria (ASFA) @la
modified: 2020-10-11
source: http://www.getty.edu/
status: Εκδοθείς
broader: Έργα τέχνης
in scheme: HUMANITIES-THESAURUS
notation: 2017
preferred label: Études @fr
preferred label: Studies @en
scope note: Καλλιτεχνικά έργα μέσω των οποίων διερευνώνται ή δοκιμάζονται οι εναλλακτικές εικαστικές διατυπώσεις ενός θέματος στο σύνολο και στις λεπτομέρειές του. Η σπουδή αποτελεί προκαταρκτικό στάδιο επεξεργασίας του τελικού έργου και είναι προϊόν μιας πιο προσεκτικής και λεπτομερούς επεξεργασίας σε σχέση με το προσχέδιο.
scope note: Works of art that explore a specific subject matter and the alternative ways of its pictorial –when it comes to the visual arts– representation in whole and in details. A study corresponds at the preliminary phase of artistic creation and has a more finished character in comparison to a sketch. @en

Έργα τέχνης
type: Concept
narrower: Σπουδές (Εικαστικές τέχνες)
notation: 618
preferred label: Artworks @en