HUMANITIES-THESAURUS
type: ConceptScheme

Πολιτικά αξιώματα
type: Concept
narrower: Ταμίας των άλλων Θεών
notation: 1696
preferred label: Political offices @en

Ταμίας των άλλων Θεών
type: Concept
contributor: Ιακωβίδου Αθηνά (ΑΑ)
contributor: Iakovidou Athena (AA) @la
created: 2019-09-10
creator: Iakovidou Athena (AA) @de
creator: Ιακωβίδου Αθηνά (ΑΑ)
modified: 2020-09-28
source: Fornara 1971
source: Thompson 1970
source: Σακελλαρίου 2004
status: Εκδοθείς
broader: Πολιτικά αξιώματα
in scheme: HUMANITIES-THESAURUS
notation: 1998
preferred label: Treasurer of the Other Gods @en
related: Ταμίαι των άλλων Θεών (Συλλογικές αρχές)
scope note: An initially annual position that occurs in ancient Athens from the year 434 BCE onwards. The treasurers of the Other Gods were ten in number and they had the duty to concentrate the treasures of the various temples on the Acropolis, in front of the Assembly. For some time, they were also in charge of certain public payments in place of the apodektai. @en
scope note: Αξίωμα που απαντάται στην αρχαία Αθήνα από το έτος 434 π.Χ. Οι ταμίες των άλλων Θεών, δέκα στον αριθμό και αρχικά ετήσιοι, συγκέντρωναν στην Ακρόπολη, ενώπιον της Βουλής, τους θησαυρούς που βρίσκονταν σε διάφορα ιερά. Για ένα διάστημα έκαναν, επίσης, ορισμένες δημόσιες πληρωμές αντί των αποδεκτών.

Ταμίαι των άλλων Θεών (Συλλογικές αρχές)
type: Concept
notation: 2043
preferred label: Treasurers of the Other Gods (Collective authorities) @en
related: Ταμίας των άλλων Θεών